{"text_format":"1","workbook":"xlsx","n_sheets":6,"sheets":["シート","データ","武器","防具","アイテム","経験値"],"not_rendered":{"charts":0,"images":1,"macros":1,"external_links":0,"defined_names":25,"comments":0,"pivot_tables":0},"unopened":[],"bounds":{"document_bytes":16777216,"sheet_cells":100000,"rows_first":2000,"rows_last":500,"rows_between":2000,"halvings":0,"cell_chars":16384,"cell_head_chars":4096},"cells_cut":0,"cells_raw":0,"read":"whole","date_system":"1900"}

{"sheet":"シート","index":0,"n_rows":67,"n_cols":59,"rows_kept":67,"cut":false,"hidden":false,"merged":[[8,11,8,14],[15,11,15,14],[14,11,14,14],[16,11,16,14],[13,11,13,14],[9,11,9,14],[12,11,12,14],[10,11,10,14],[11,11,11,14],[49,1,50,1],[49,2,50,2],[65,1,66,1],[65,2,66,2],[59,1,60,1],[59,2,60,2],[61,1,62,1],[61,2,62,2],[49,8,49,14],[50,8,50,14],[51,8,51,14],[52,8,52,14],[63,1,64,1],[63,2,64,2],[55,1,56,1],[55,2,56,2],[57,1,58,1],[57,2,58,2],[61,55,62,55],[63,55,64,55],[35,1,36,1],[35,2,36,2],[37,1,38,1],[37,2,38,2],[31,1,32,1],[31,2,32,2],[33,1,34,1],[33,2,34,2],[43,1,44,1],[43,2,44,2],[45,1,46,1],[45,2,46,2],[39,1,40,1],[39,2,40,2],[41,1,42,1],[41,2,42,2],[51,1,52,1],[51,2,52,2],[53,1,54,1],[53,2,54,2],[47,1,48,1],[47,2,48,2],[59,50,60,50],[61,50,62,50],[63,50,64,50],[49,50,50,50],[51,50,52,50],[53,50,54,50],[55,50,56,50],[65,50,66,50],[31,55,32,55],[33,55,34,55],[35,55,36,55],[37,55,38,55],[39,55,40,55],[41,55,42,55],[43,55,44,55],[45,55,46,55],[47,55,48,55],[65,55,66,55],[53,55,54,55],[55,55,56,55],[57,55,58,55],[59,55,60,55],[49,55,50,55],[51,55,52,55],[65,38,66,38],[47,37,48,37],[49,37,50,37],[61,40,62,40],[31,45,32,45],[33,45,34,45],[35,45,36,45],[37,45,38,45],[39,45,40,45],[41,45,42,45],[43,45,44,45],[45,45,46,45],[47,45,48,45],[57,45,58,45],[59,45,60,45],[61,45,62,45],[63,45,64,45],[49,45,50,45],[51,45,52,45],[53,45,54,45],[55,45,56,45],[65,45,66,45],[65,30,66,30],[31,35,32,35],[33,35,34,35],[35,35,36,35],[37,35,38,35],[39,35,40,35],[41,35,42,35],[43,35,44,35],[45,35,46,35],[55,35,56,35],[57,35,58,35],[59,35,60,35],[61,35,62,35],[47,35,48,35],[49,35,50,35],[51,35,52,35],[53,35,54,35],[63,35,64,35],[65,35,66,35],[55,30,56,30],[57,30,58,30],[59,30,60,30],[61,30,62,30],[47,30,48,30],[49,30,50,30],[51,30,52,30],[53,30,54,30],[63,30,64,30],[57,57,58,57],[59,57,60,57],[61,57,62,57],[47,57,48,57],[49,57,50,57],[51,57,52,57],[53,57,54,57],[63,57,64,57],[65,57,66,57],[31,57,32,57],[33,57,34,57],[35,57,36,57],[37,57,38,57],[39,57,40,57],[41,57,42,57],[43,57,44,57],[45,57,46,57],[55,57,56,57],[65,47,66,47],[31,52,32,52],[33,52,34,52],[35,52,36,52],[37,52,38,52],[39,52,40,52],[41,52,42,52],[43,52,44,52],[45,52,46,52],[55,52,56,52],[57,52,58,52],[59,52,60,52],[61,52,62,52],[47,52,48,52],[49,52,50,52],[51,52,52,52],[53,52,54,52],[63,52,64,52],[65,52,66,52],[31,50,32,50],[33,50,34,50],[35,50,36,50],[37,50,38,50],[39,50,40,50],[31,37,32,37],[33,37,34,37],[35,37,36,37],[37,37,38,37],[39,37,40,37],[41,37,42,37],[43,37,44,37],[45,37,46,37],[53,42,54,42],[43,40,44,40],[45,40,46,40],[31,40,32,40],[33,40,34,40],[35,40,36,40],[37,40,38,40],[39,40,40,40],[41,40,42,40],[47,40,48,40],[49,40,50,40],[51,40,52,40],[53,40,54,40],[57,58,58,58],[59,58,60,58],[61,58,62,58],[63,58,64,58],[49,58,50,58],[51,58,52,58],[53,58,54,58],[55,58,56,58],[65,58,66,58],[31,58,32,58],[33,58,34,58],[35,58,36,58],[37,58,38,58],[39,58,40,58],[41,58,42,58],[43,58,44,58],[45,58,46,58],[47,58,48,58],[65,48,66,48],[31,53,32,53],[33,53,34,53],[35,53,36,53],[37,53,38,53],[39,53,40,53],[41,53,42,53],[43,53,44,53],[45,53,46,53],[47,53,48,53],[57,53,58,53],[59,53,60,53],[61,53,62,53],[63,53,64,53],[49,53,50,53],[51,53,52,53],[53,53,54,53],[55,53,56,53],[65,53,66,53],[41,50,42,50],[43,50,44,50],[45,50,46,50],[47,50,48,50],[57,50,58,50],[59,48,60,48],[61,48,62,48],[63,48,64,48],[39,38,40,38],[41,38,42,38],[43,38,44,38],[55,48,56,48],[55,42,56,42],[39,47,40,47],[55,47,56,47],[57,47,58,47],[59,47,60,47],[61,47,62,47],[49,47,50,47],[51,47,52,47],[53,47,54,47],[41,47,42,47],[43,47,44,47],[63,47,64,47],[31,38,32,38],[33,38,34,38],[35,38,36,38],[37,38,38,38],[43,42,44,42],[45,42,46,42],[47,42,48,42],[35,47,36,47],[57,48,58,48],[37,47,38,47],[49,43,50,43],[33,32,34,32],[33,33,34,33],[39,33,40,33],[41,32,42,32],[41,33,42,33],[53,33,54,33],[45,32,46,32],[39,32,40,32],[47,32,48,32],[49,32,50,32],[43,32,44,32],[43,33,44,33],[45,33,46,33],[47,33,48,33],[49,33,50,33],[51,33,52,33],[49,38,50,38],[51,37,52,37],[55,37,56,37],[57,37,58,37],[59,37,60,37],[59,32,60,32],[53,38,54,38],[55,38,56,38],[57,38,58,38],[59,38,60,38],[53,37,54,37],[55,32,56,32],[57,32,58,32],[55,33,56,33],[57,33,58,33],[59,33,60,33],[55,43,56,43],[53,43,54,43],[51,38,52,38],[57,42,58,42],[55,40,56,40],[57,40,58,40],[51,42,52,42],[61,32,62,32],[63,32,64,32],[61,38,62,38],[63,38,64,38],[63,33,64,33],[61,33,62,33],[65,41,66,41],[65,40,66,40],[63,40,64,40],[57,43,58,43],[59,43,60,43],[59,42,60,42],[61,42,62,42],[63,42,64,42],[65,42,66,42],[59,40,60,40],[49,48,50,48],[51,48,52,48],[31,42,32,42],[33,42,34,42],[35,42,36,42],[37,42,38,42],[39,42,40,42],[41,42,42,42],[31,48,32,48],[49,42,50,42],[33,48,34,48],[35,48,36,48],[37,48,38,48],[31,43,32,43],[33,43,34,43],[35,43,36,43],[37,43,38,43],[31,47,32,47],[33,47,34,47],[51,43,52,43],[39,43,40,43],[41,43,42,43],[43,43,44,43],[45,43,46,43],[43,8,43,14],[44,8,44,14],[45,8,45,14],[46,8,46,14],[47,8,47,14],[48,8,48,14],[39,48,40,48],[41,48,42,48],[43,48,44,48],[45,48,46,48],[40,9,40,13],[41,9,41,13],[42,9,42,13],[47,48,48,48],[47,38,48,38],[45,38,46,38],[47,43,48,43],[45,47,46,47],[47,47,48,47],[39,30,40,30],[41,30,42,30],[43,30,44,30],[45,30,46,30],[19,33,20,33],[13,20,14,20],[15,20,16,20],[39,9,39,13],[35,32,36,32],[35,33,36,33],[37,32,38,32],[37,33,38,33],[31,32,32,32],[31,33,32,33],[31,30,32,30],[33,30,34,30],[35,30,36,30],[37,30,38,30],[15,33,16,33],[17,33,18,33],[18,11,18,14],[17,20,18,20],[15,32,16,32],[17,32,18,32],[15,31,16,31],[17,31,18,31],[15,30,16,30],[17,30,18,30],[9,20,10,20],[11,20,12,20],[12,9,12,10],[13,33,14,33],[13,32,14,32],[13,4,14,4],[11,4,12,4],[13,30,14,30],[13,31,14,31],[9,8,10,8],[11,8,12,8],[13,8,14,8],[15,8,16,8],[19,8,20,8],[9,6,10,6],[11,6,12,6],[23,4,24,4],[9,5,10,5],[11,5,12,5],[13,5,14,5],[15,5,16,5],[17,5,18,5],[19,5,20,5],[21,5,22,5],[9,4,10,4],[19,4,20,4],[15,4,16,4],[17,4,18,4],[17,8,18,8],[13,6,14,6],[15,6,16,6],[17,6,18,6],[21,8,22,8],[23,8,24,8],[28,4,28,5],[28,7,28,8],[23,5,24,5],[21,6,22,6],[23,6,24,6],[21,4,22,4],[19,6,20,6],[31,5,32,5],[33,5,34,5],[35,5,36,5],[37,5,38,5],[39,5,40,5],[43,4,44,4],[45,4,46,4],[47,4,48,4],[49,4,50,4],[31,4,32,4],[33,4,34,4],[35,4,36,4],[37,4,38,4],[39,4,40,4],[41,4,42,4],[33,6,34,6],[35,6,36,6],[33,7,34,7],[35,7,36,7],[53,5,54,5],[55,5,56,5],[57,5,58,5],[59,5,60,5],[61,5,62,5],[41,5,42,5],[43,5,44,5],[45,5,46,5],[47,5,48,5],[49,5,50,5],[51,5,52,5],[65,4,66,4],[65,5,66,5],[65,6,66,6],[65,7,66,7],[62,8,66,18],[56,8,60,18],[51,7,52,7],[53,7,54,7],[55,7,56,7],[55,6,56,6],[57,6,58,6],[59,6,60,6],[61,6,62,6],[51,6,52,6],[53,6,54,6],[63,5,64,5],[55,4,56,4],[57,4,58,4],[59,4,60,4],[61,4,62,4],[63,4,64,4],[51,4,52,4],[53,4,54,4],[53,9,53,11],[29,5,29,18],[57,7,58,7],[59,7,60,7],[61,7,62,7],[63,7,64,7],[63,6,64,6],[39,7,40,7],[41,7,42,7],[36,10,36,12],[37,10,37,12],[43,7,44,7],[45,7,46,7],[47,7,48,7],[49,7,50,7],[47,6,48,6],[49,6,50,6],[37,7,38,7],[37,6,38,6],[39,6,40,6],[41,6,42,6],[43,6,44,6],[45,6,46,6],[31,7,32,7],[31,6,32,6],[19,20,20,20],[21,20,22,20],[23,20,24,20],[26,20,27,20],[19,32,20,32],[21,32,22,32],[23,32,24,32],[19,30,20,30],[21,30,22,30],[23,30,24,30],[11,35,12,35],[11,37,12,37],[11,38,12,38],[6,32,6,33],[5,32,5,33],[9,30,10,30],[11,30,12,30],[9,31,10,31],[11,31,12,31],[9,33,10,33],[11,33,12,33],[9,32,10,32],[11,32,12,32],[23,37,24,37],[23,38,24,38],[5,42,5,43],[6,42,6,43],[9,40,10,40],[9,42,10,42],[9,43,10,43],[9,41,10,41],[17,35,18,35],[17,37,18,37],[17,38,18,38],[19,35,20,35],[19,37,20,37],[19,38,20,38],[13,35,14,35],[13,37,14,37],[13,38,14,38],[15,35,16,35],[15,37,16,37],[15,38,16,38],[6,37,6,38],[9,35,10,35],[9,37,10,37],[9,38,10,38],[15,43,16,43],[17,40,18,40],[17,42,18,42],[17,43,18,43],[15,41,16,41],[17,41,18,41],[11,40,12,40],[5,37,5,38],[11,42,12,42],[11,43,12,43],[13,40,14,40],[13,42,14,42],[13,43,14,43],[11,41,12,41],[13,41,14,41],[13,46,14,46],[15,45,16,45],[15,47,16,47],[15,48,16,48],[23,40,24,40],[23,42,24,42],[23,43,24,43],[5,47,5,48],[6,47,6,48],[9,45,10,45],[9,47,10,47],[9,48,10,48],[11,45,12,45],[11,47,12,47],[19,40,20,40],[19,42,20,42],[19,43,20,43],[21,40,22,40],[21,42,22,42],[21,43,22,43],[19,41,20,41],[21,41,22,41],[15,40,16,40],[15,42,16,42],[5,57,5,58],[6,57,6,58],[9,55,10,55],[9,57,10,57],[9,58,10,58],[11,55,12,55],[11,57,12,57],[11,53,12,53],[11,58,12,58],[5,52,5,53],[6,52,6,53],[9,52,10,52],[9,53,10,53],[11,52,12,52],[13,58,14,58],[18,9,19,10],[17,58,18,58],[19,31,20,31],[19,52,20,52],[19,53,20,53],[15,50,16,50],[15,52,16,52],[21,57,22,57],[21,58,22,58],[15,55,16,55],[15,57,16,57],[15,58,16,58],[17,55,18,55],[17,57,18,57],[19,58,20,58],[17,50,18,50],[17,52,18,52],[17,53,18,53],[17,51,18,51],[15,51,16,51],[21,50,22,50],[21,52,22,52],[21,53,22,53],[23,58,24,58],[17,11,17,14],[19,11,19,14],[21,11,21,14],[23,11,23,14],[19,55,20,55],[19,57,20,57],[20,11,20,14],[22,11,22,14],[23,53,24,53],[19,51,20,51],[21,51,22,51],[23,47,24,47],[23,48,24,48],[19,47,20,47],[17,45,18,45],[17,47,18,47],[17,48,18,48],[19,48,20,48],[21,45,22,45],[21,47,22,47],[21,48,22,48],[21,37,22,37],[21,38,22,38],[8,9,8,10],[9,9,9,10],[10,9,10,10],[11,9,11,10],[13,9,13,10],[14,9,14,10],[15,9,15,10],[16,9,17,10],[23,57,24,57],[13,55,14,55],[13,57,14,57],[13,50,14,50],[13,52,14,52],[13,53,14,53],[11,51,12,51],[13,51,14,51],[15,53,16,53],[9,50,10,50],[11,50,12,50],[15,46,16,46],[11,48,12,48],[13,45,14,45],[13,47,14,47],[13,48,14,48],[24,11,24,18],[24,9,24,10],[20,9,21,10],[22,9,23,10],[26,9,26,10],[27,9,27,10],[26,12,26,13],[27,12,27,13],[25,12,25,13],[21,31,22,31],[23,31,24,31],[65,31,66,31],[23,36,24,36],[21,35,22,35],[21,33,22,33],[23,33,24,33],[23,35,24,35],[51,32,52,32],[53,32,54,32],[65,32,66,32],[65,33,66,33],[23,46,24,46],[23,45,24,45],[19,45,20,45],[65,56,66,56],[9,36,10,36],[11,36,12,36],[13,36,14,36],[15,36,16,36],[17,36,18,36],[19,36,20,36],[21,36,22,36],[9,46,10,46],[11,46,12,46],[65,46,66,46],[65,51,66,51],[65,36,66,36],[53,48,54,48],[61,43,62,43],[63,43,64,43],[65,43,66,43],[61,37,62,37],[63,37,64,37],[65,37,66,37],[21,55,22,55],[23,56,24,56],[9,51,10,51],[25,14,25,18],[48,20,48,21],[27,17,27,18],[26,17,26,18],[26,14,26,15],[27,14,27,15],[23,50,24,50],[19,50,20,50],[23,51,24,51],[9,56,10,56],[11,56,12,56],[13,56,14,56],[15,56,16,56],[17,56,18,56],[19,56,20,56],[21,56,22,56],[23,55,24,55],[23,52,24,52],[23,41,24,41],[17,46,18,46],[19,46,20,46],[21,46,22,46],[62,20,62,21],[63,20,63,21],[64,20,64,21],[65,20,65,21],[66,20,66,21],[55,20,55,21],[56,20,56,21],[57,20,57,21],[58,20,58,21],[59,20,59,21],[60,20,60,21],[21,2,22,2],[23,2,24,2],[9,2,10,2],[11,2,12,2],[13,2,14,2],[15,2,16,2],[17,2,18,2],[19,2,20,2],[61,20,61,21],[49,20,49,21],[50,20,50,21],[51,20,51,21],[52,20,52,21],[53,20,53,21],[54,20,54,21],[28,12,28,15],[38,10,38,12],[35,10,35,12],[28,16,28,18],[32,10,32,12],[33,10,33,12],[34,10,34,12],[28,9,28,10],[31,10,31,12]]}
[]
[null,"■使用方法",null,"1)","右の「入力全クリア」ボタンを押す。"]
[null,null,null,"2)","色つきセルに入力する（オレンジ色のセルは、クリックするとドロップダウンメニューが出るので、そこから選択）。"]
[null,null,null,"3)","キーボードの[F9]を押して再計算する。"]
[null,null,null,"4)","右の「ダイス分計算」ボタンを押す。",null,null,null,null,null,null,null,null,null,null,null,null,null,null,null,null,null,null,null,null,null,null,null,null,null,"今回",null,null,null,null,"1回前",null,null,null,null,"2回前",null,null,null,null,"3回前",null,null,null,null,"4回前",null,null,null,null,"5回前"]
[null,null,null,"5)","キーボードの[F9]を押して再計算する。",null,null,null,null,null,null,null,null,null,null,null,null,null,null,null,null,null,null,null,null,null,null,null,null,null,"レベル",null,{"$f":"+V31","v":100},null,null,"レベル",null,{"$f":"+V32","v":0},null,null,"レベル",null,{"$f":"+V33","v":0},null,null,"レベル",null,{"$f":"+V34","v":0},null,null,"レベル",null,{"$f":"+V35","v":0},null,null,"レベル",null,{"$f":"+V36","v":0}]
[null,null,null,null,"フェイタル・ウォーリアーズ　キャラクターシート",null,null,null,null,null,null,null,null,null,null,null,null,null,null,null,"作製時",null,null,null,null,null,null,null,null,null,"クラス",null,{"$f":"+W31","v":"なし"},null,null,"クラス",null,{"$f":"+W32","v":"なし"},null,null,"クラス",null,{"$f":"+W33","v":"なし"},null,null,"クラス",null,{"$f":"+W34","v":"なし"},null,null,"クラス",null,{"$f":"+W35","v":"なし"},null,null,"クラス",null,{"$f":"+W36","v":"なし"}]
[null,null,null,null,null,null,null,null,null,null,null,null,null,null,null,null,null,null,null,null,"（2D8加算値）"]
[null,null,"上昇値修正",null,"特性値",null,"回避値","修正","上昇値","名前",null,"リベ・ガルフェン（メイナード・シレスタ）",null,null,null,null,null,null,null,null,"回避値","各欄には数値のみ入力",null,null,null,null,null,null,null,null,"特性値","乱数分","回避値","上昇値",null,"特性値","乱数分","回避値","上昇値",null,"特性値","乱数分","回避値","上昇値",null,"特性値","乱数分","回避値","上昇値",null,"特性値","乱数分","回避値","上昇値",null,"特性値","乱数分","回避値","上昇値"]
[null,null,null,null,"筋力",{"$f":"+AE10+COUNTA(W$38)*10*L$12+C10*L$12","v":10251},{"$f":"IF(W$38<>\"\",ROUNDDOWN(F10/10,0),AG10)","v":1025},"ダメージ",{"$f":"+AH10+COUNTA(W$38)*10+C10","v":100},"種族",null,"異世界神",null,null,null,null,null,null,null,null,4,"（「S=」などは入力不要）",null,null,null,null,null,null,null,null,{"$f":"IF(AG$6=0,0,ROUNDDOWN(RAND()*(10-1)+1,0)-1+AF10+AH10*(AG$6-1)+IF(AL$6=0,(VLOOKUP($L$10,データ!$B$4:$S$13,2,FALSE)+$U10)*10,ROUNDDOWN(AL10/2,0)*10))","v":10251},205,{"$f":"+IF(VLOOKUP(AG$7,データ!$B$17:$S$47,18,FALSE)+VLOOKUP($L$10,データ!$B$4:$S$13,18,FALSE)>0,ROUNDDOWN(AE10/10,0),MIN(ROUNDDOWN(AE10/10,0),18))","v":1025},{"$f":"IF(AG$6=0,0,VLOOKUP(AG$7,データ!$B$17:$S$47,10,FALSE)+VLOOKUP($L$10,データ!$B$4:$S$13,10,FALSE)+VLOOKUP($L$14,データ!$B$52:$S$54,10,FALSE))","v":100},null,{"$f":"IF(AL$6=0,0,ROUNDDOWN(RAND()*(10-1)+1,0)-1+AK10+AM10*(AL$6-1)+IF(AQ$6=0,(VLOOKUP($L$10,データ!$B$4:$S$13,2,FALSE)+$U10)*10,ROUNDDOWN(AQ10/2,0)*10))","v":0},null,{"$f":"+IF(VLOOKUP(AL$7,データ!$B$17:$S$47,18,FALSE)+VLOOKUP($L$10,データ!$B$4:$S$13,18,FALSE)>0,ROUNDDOWN(AJ10/10,0),MIN(ROUNDDOWN(AJ10/10,0),18))","v":0},{"$f":"IF(AL$6=0,0,VLOOKUP(AL$7,データ!$B$17:$S$47,10,FALSE)+VLOOKUP($L$10,データ!$B$4:$S$13,10,FALSE)+VLOOKUP($L$14,データ!$B$52:$S$54,10,FALSE))","v":0},null,{"$f":"IF(AQ$6=0,0,ROUNDDOWN(RAND()*(10-1)+1,0)-1+AP10+AR10*(AQ$6-1)+IF(AV$6=0,(VLOOKUP($L$10,データ!$B$4:$S$13,2,FALSE)+$U10)*10,ROUNDDOWN(AV10/2,0)*10))","v":0},null,{"$f":"+IF(VLOOKUP(AQ$7,データ!$B$17:$S$47,18,FALSE)+VLOOKUP($L$10,データ!$B$4:$S$13,18,FALSE)>0,ROUNDDOWN(AO10/10,0),MIN(ROUNDDOWN(AO10/10,0),18))","v":0},{"$f":"IF(AQ$6=0,0,VLOOKUP(AQ$7,データ!$B$17:$S$47,10,FALSE)+VLOOKUP($L$10,データ!$B$4:$S$13,10,FALSE)+VLOOKUP($L$14,データ!$B$52:$S$54,10,FALSE))","v":0},null,{"$f":"IF(AV$6=0,0,ROUNDDOWN(RAND()*(10-1)+1,0)-1+AU10+AW10*(AV$6-1)+IF(BA$6=0,(VLOOKUP($L$10,データ!$B$4:$S$13,2,FALSE)+$U10)*10,ROUNDDOWN(BA10/2,0)*10))","v":0},null,{"$f":"+IF(VLOOKUP(AV$7,データ!$B$17:$S$47,18,FALSE)+VLOOKUP($L$10,データ!$B$4:$S$13,18,FALSE)>0,ROUNDDOWN(AT10/10,0),MIN(ROUNDDOWN(AT10/10,0),18))","v":0},{"$f":"IF(AV$6=0,0,VLOOKUP(AV$7,データ!$B$17:$S$47,10,FALSE)+VLOOKUP($L$10,データ!$B$4:$S$13,10,FALSE)+VLOOKUP($L$14,データ!$B$52:$S$54,10,FALSE))","v":0},null,{"$f":"IF(BA$6=0,0,ROUNDDOWN(RAND()*(10-1)+1,0)-1+AZ10+BB10*(BA$6-1)+IF(BF$6=0,(VLOOKUP($L$10,データ!$B$4:$S$13,2,FALSE)+$U10)*10,ROUNDDOWN(BF10/2,0)*10))","v":0},null,{"$f":"+IF(VLOOKUP(BA$7,データ!$B$17:$S$47,18,FALSE)+VLOOKUP($L$10,データ!$B$4:$S$13,18,FALSE)>0,ROUNDDOWN(AY10/10,0),MIN(ROUNDDOWN(AY10/10,0),18))","v":0},{"$f":"IF(BA$6=0,0,VLOOKUP(BA$7,データ!$B$17:$S$47,10,FALSE)+VLOOKUP($L$10,データ!$B$4:$S$13,10,FALSE)+VLOOKUP($L$14,データ!$B$52:$S$54,10,FALSE))","v":0},null,{"$f":"IF(BF$6=0,0,ROUNDDOWN(RAND()*(10-1)+1,0)-1+BE10+BG10*(BF$6-1)+IF(BK$6=0,(VLOOKUP($L$10,データ!$B$4:$S$13,2,FALSE)+$U10)*10,ROUNDDOWN(BK10/2,0)*10))","v":0},null,{"$f":"+IF(VLOOKUP(BF$7,データ!$B$17:$S$47,18,FALSE)+VLOOKUP($L$10,データ!$B$4:$S$13,18,FALSE)>0,ROUNDDOWN(BD10/10,0),MIN(ROUNDDOWN(BD10/10,0),18))","v":0},{"$f":"IF(BF$6=0,0,VLOOKUP(BF$7,データ!$B$17:$S$47,10,FALSE)+VLOOKUP($L$10,データ!$B$4:$S$13,10,FALSE)+VLOOKUP($L$14,データ!$B$52:$S$54,10,FALSE))","v":0}]
{"$rows_left_out":58}
{"sheet":"データ","index":1,"n_rows":101,"n_cols":54,"rows_kept":101,"cut":false,"hidden":false,"merged":[]}
[]
[null,null,"回避値",null,null,null,null,null,null,null,"上昇値",null,null,null,null,null,null,null,"回避値","命中率","防御力","技能"]
[null,"種族一覧","S","I","P","M","V","A","L","F","筋力","知恵","信仰心","精神力","生命力","敏捷度","幸運度","魅力","無制限","修正","修正","剣","斧","棒","鞭","槌","槍","弓矢","投擲","格闘","盾","一般"]
[null,"人間",4,5,1,3,5,3,1,3,2,3,0,1,3,0,0,1,0,null,null,40,10,20,20,10,10,10,20,20,20,10]
[null,"エルフ",2,3,3,5,1,3,3,5,0,1,1,3,0,1,1,3,0,null,null,10,10,20,20,10,10,40,20,20,20,10]
[null,"ドワーフ",5,1,5,2,4,1,4,1,3,0,3,0,2,0,2,0,0,5,null,10,40,20,20,10,10,10,20,20,20,10]
[null,"ミナンスロープ",1,2,4,1,2,5,5,2,0,1,1,1,0,3,3,1,0,10,null,10,10,20,20,10,40,10,20,20,20,10]
[null,"ハーフエルフ",3,4,2,4,3,3,2,4,1,2,0,2,2,1,0,2,0,null,null,10,10,20,20,40,10,10,20,20,20,10]
[null,"神",10,10,10,10,10,10,10,10,100,100,100,100,100,100,100,100,1,null,200,90,90,90,90,90,90,90,90,90,90,90]
[null,"異世界神",10,10,10,10,10,10,10,10,100,100,100,100,100,100,100,100,1,null,200,90,90,90,90,90,90,90,90,90,90,90]
{"$rows_left_out":92}
{"sheet":"武器","index":2,"n_rows":200,"n_cols":19,"rows_kept":200,"cut":false,"hidden":false,"merged":[]}
[]
[]
[null,"材質",null,"攻撃力","防御力","命中率","回避率","重量（鎧）","重量","価格"]
[null,"　",null,0,0,null,null,0,0,1]
[null,"ブラス",null,5,1,null,null,-5,-1,10]
[null,"アイアン",null,10,2,null,null,-10,-2,20]
[null,"スチール",null,15,3,null,null,-15,-3,30]
[null,"シルバー",null,20,4,null,null,-20,-4,40]
[null,"ハイパー",null,25,5,null,null,-25,-5,50]
[]
{"$rows_left_out":191}
{"sheet":"防具","index":3,"n_rows":358,"n_cols":19,"rows_kept":358,"cut":false,"hidden":false,"merged":[]}
[]
[]
[null,"材質",null,"攻撃力","防御力","命中率","回避率","重量（鎧）","重量","価格"]
[null,"　",null,0,0,null,null,0,0,1]
[null,"ブラス",null,5,1,null,null,-5,-1,10]
[null,"アイアン",null,10,2,null,null,-10,-2,20]
[null,"スチール",null,15,3,null,null,-15,-3,30]
[null,"シルバー",null,20,4,null,null,-20,-4,40]
[null,"ハイパー",null,25,5,null,null,-25,-5,50]
[]
{"$rows_left_out":349}
{"sheet":"アイテム","index":4,"n_rows":100,"n_cols":4,"rows_kept":100,"cut":false,"hidden":false,"merged":[]}
[]
[null,"アイテム"]
[null,"名称","重量","価格"]
[null,"　",0,0]
[null,"油（100ml：ランプで5時間）",0.1,5]
[null,"ランプ",0.5,30]
[null,"火打ち石（一組）",0.1,10]
[null,"たいまつ",0.5,10]
[null,"ろうそく",0.1,3]
[null,"しょく台",0.1,10]
{"$rows_left_out":91}
{"sheet":"経験値","index":5,"n_rows":103,"n_cols":10,"rows_kept":103,"cut":false,"hidden":false,"merged":[[53,2,54,5]]}
[]
[null,"レベル","必要経験値",null,null,null,"呪文№"]
[null,"到達レベル","初級戦士系","初級術者系","上級戦士系","上級術者系","精霊№","神聖№","精神№","暗黒№"]
[null,1,0,0,0,0,1,1,1,1]
[null,2,1000,1200,1600,1400,1,2,2,2]
[null,3,2000,2400,3200,2800,2,3,3,3]
[null,4,3000,3600,4800,4200,3,4,4,4]
[null,5,4500,5400,7200,6300,4,4,4,4]
[null,6,6700,8100,10800,9400,4,5,5,5]
[null,7,10000,12100,16200,14100,5,6,6,6]
{"$rows_left_out":93}